Reaction Details
TargetTrace amine-associated receptor 1
LigandBDBM50240772
Substrate/Competitorn/a
EC50 610.95±n/a nM
Citation PubChem, PC Fluorescence-based cell-based high throughput dose response assay to identify agonists of the human trace amine associated receptor 1 (TAAR1) PubChem Bioassay(2013)[AID]
 
Trace amine-associated receptor 1
Name:Trace amine-associated receptor 1
Type:PROTEIN
Mol. Mass.:39107.47
Organism:Homo sapiens (Human)
Description:ChEMBL_792734
Residue:339
BDBM50240772
NameBDBM50240772
Synonyms:(1R,2S)-(-)-2-phenylcyclopropylamine (tranylcypromine)2-Phenyl-cyclopropylamine CHEMBL1179 TRANYLCYPROMINE US10836743, Compound TCP US9180183, Tranylcypromine rel-Tranylcypromine
TypeSmall organic molecule
Emp. Form.C9H11N
Mol. Mass.133.1903
SMILESN[C@@H]1C[C@H]1c1ccccc1