Reaction Details
TargetProbable global transcription activator SNF2L2
LigandBDBM83820
Substrate/Competitorn/a
EC50 3376±n/a nM
Citation PubChem, PC Luminescence-based cell-based high throughput dose response assay to identify activators of the function of SWI/SNF related, matrix associated, actin dependent regulator of chromatin, subfamily a, member 2 (SMARCA2, BRM) PubChem Bioassay(2013)[AID]
 
Probable global transcription activator SNF2L2
Name:Probable global transcription activator SNF2L2
Type:Enzyme Catalytic Domain
Mol. Mass.:181290.91
Organism:Homo sapiens (Human)
Description:P51531
Residue:1590
BDBM83820
NameBDBM83820
Synonyms:9-Amino-acridinium MLS001241050 acridin-10-ium-9-amine;chloride cid_24892261
TypeSmall organic molecule
Emp. Form.C13H11N2
Mol. Mass.195.2393
SMILESNc1c2ccccc2[nH+]c2ccccc12