Reaction Details
TargetSerine/threonine-protein kinase ATR
LigandBDBM97372
Substrate/Competitorn/a
Meas. Tech.ATR Inhibition Assay
pH7.5±0
Temperature298.15±0 K
Ki 0.503±0.0 nM
IC50 200±0.0 nM
Citation Charrier, JDYoung, SCDavis, CJStudley, J Compounds useful as inhibitors of atr kinase US Patent US20130089624 Publication Date 4/11/2013
 
Serine/threonine-protein kinase ATR
Name:Serine/threonine-protein kinase ATR
Type:Protein
Mol. Mass.:301404.58
Organism:Homo sapiens (Human)
Description:Q13535
Residue:2644
BDBM97372
NameBDBM97372
Synonyms:US20130089624, 1
TypeSmall molecule
Emp. Form.C26H27N5O4S
Mol. Mass.505.589
SMILESCC(C)S(=O)(=O)c1ccc(cc1)-c1cnc(N)c(n1)-c1cc(no1)-c1ccc(cc1)[C@@H]1COCCN1