Reaction Details
TargetIsocitrate dehydrogenase [NADP] cytoplasmic [R132C]
LigandBDBM279989
Substrate/Competitorn/a
Meas. Tech.In Vitro Assays for IDH1m (R132H or R132C) Inhibitors
pH6.5±n/a
Temperature298.15±n/a K
IC50<50±n/a nM
Commentsextracted
Citation Konteatis, ZDPopovici-Muller, JTravins, JMZahler, RCai, ZZhou, D Therapeutically active compounds and their methods of use US Patent US10028961 Publication Date 7/24/2018
 
Isocitrate dehydrogenase [NADP] cytoplasmic [R132C]
Name:Isocitrate dehydrogenase [NADP] cytoplasmic [R132C]
Type:Enzyme Catalytic Domain
Mol. Mass.:46607.23
Organism:Homo sapiens (Human)
Description:O75874[R132C]
Residue:414
BDBM279989
NameBDBM279989
Synonyms:US10028961, Compound 142 US10946023, Compound 142
TypeSmall organic molecule
Emp. Form.C14H13ClF6N6
Mol. Mass.414.737
SMILESC[C@H](Nc1nc(N[C@@H](C)C(F)(F)F)nc(n1)-c1cccc(Cl)n1)C(F)(F)F