Reaction Details
TargetIsocitrate dehydrogenase [NADP] cytoplasmic [R132C]
LigandBDBM280017
Substrate/Competitorn/a
Meas. Tech.In Vitro Assays for IDH1m (R132H or R132C) Inhibitors
pH6.5±n/a
Temperature298.15±n/a K
IC50<50±n/a nM
Commentsextracted
Citation Konteatis, ZDPopovici-Muller, JTravins, JMZahler, RCai, ZZhou, D Therapeutically active compounds and their methods of use US Patent US10028961 Publication Date 7/24/2018
 
Isocitrate dehydrogenase [NADP] cytoplasmic [R132C]
Name:Isocitrate dehydrogenase [NADP] cytoplasmic [R132C]
Type:Enzyme Catalytic Domain
Mol. Mass.:46607.23
Organism:Homo sapiens (Human)
Description:O75874[R132C]
Residue:414
BDBM280017
NameBDBM280017
Synonyms:US10028961, Compound 170 US10946023, Compound 170
TypeSmall organic molecule
Emp. Form.C15H13F7N6S
Mol. Mass.442.358
SMILESFC(F)(F)c1nc(cs1)-c1nc(NC2CC(F)(F)C2)nc(NC2CC(F)(F)C2)n1