Reaction Details
TargetMacrophage colony-stimulating factor 1
LigandBDBM97732
Substrate/Competitorn/a
Meas. Tech.Fluorescence Polarization Competition Immunoassay
pH7.5±0
IC50 0.4±n/a nM
Citation Illig, CRBallentine, SKChen, JDesJarlais, RLMeegalla, SKWall, MWilson, K Inhibitors of c-fms kinase US Patent US8481564 Publication Date 7/9/2013
 
Macrophage colony-stimulating factor 1
Name:Macrophage colony-stimulating factor 1
Type:Protein
Mol. Mass.:60631.84
Organism:Mus musculus (Mouse)
Description:P07141
Residue:552
BDBM97732
NameBDBM97732
Synonyms:US8481564, 8
TypeSmall organic molecule
Emp. Form.C25H30N6O2
Mol. Mass.446.5447
SMILESCN1CC(CN(C)C1=O)c1ccc(NC(=O)c2nc(c[nH]2)C#N)c(c1)C1=CCC(C)(C)CC1