Reaction Details
TargetProto-oncogene tyrosine-protein kinase Src
LigandBDBM50193878
Substrate/Competitorn/a
Meas. Tech.Luciferase-Based Assay
Temperature298.15±n/a K
IC50>10000±0.0 nM
Commentsextracted
Citation Gong, XBarrett, KCao, JGritzen, CNoronha, GHood, JDMak, CCMcPherson, APathak, VPRenick, JSoll, RMSplittgerber, UWrasidlo, WZeng, BZhao, NDneprovskaia, E Benzotriazine inhibitors of kinases US Patent US8481536 Publication Date 7/9/2013
 
Proto-oncogene tyrosine-protein kinase Src
Name:Proto-oncogene tyrosine-protein kinase Src
Type:Protein
Mol. Mass.:59838.60
Organism:Homo sapiens (Human)
Description:P12931
Residue:536
BDBM50193878
NameBDBM50193878
Synonyms:7-(2,6-dimethylphenyl)-5-methyl-N-(pyridin-2-yl)benzo[e][1,2,4]triazin-3-amine US8481536, 330
TypeSmall organic molecule
Emp. Form.C21H19N5
Mol. Mass.341.4091
SMILESCc1cccc(C)c1-c1cc(C)c2nc(Nc3ccccn3)nnc2c1