Reaction Details
TargetProto-oncogene tyrosine-protein kinase Src
LigandBDBM50198822
Substrate/Competitorn/a
Meas. Tech.Luciferase-Based Assay
Temperature298.15±n/a K
IC50 12.6±0.0 nM
Commentsextracted
Citation Gong, XBarrett, KCao, JGritzen, CNoronha, GHood, JDMak, CCMcPherson, APathak, VPRenick, JSoll, RMSplittgerber, UWrasidlo, WZeng, BZhao, NDneprovskaia, E Benzotriazine inhibitors of kinases US Patent US8481536 Publication Date 7/9/2013
 
Proto-oncogene tyrosine-protein kinase Src
Name:Proto-oncogene tyrosine-protein kinase Src
Type:Protein
Mol. Mass.:59838.60
Organism:Homo sapiens (Human)
Description:P12931
Residue:536
BDBM50198822
NameBDBM50198822
Synonyms:7-(2,6-dimethylphenyl)-5-methyl-N-(4-(3-(pyrrolidin-1-yl)propoxy)phenyl)benzo[e][1,2,4]triazin-3-amine US8481536, 366
TypeSmall organic molecule
Emp. Form.C29H33N5O
Mol. Mass.467.6052
SMILESCc1cccc(C)c1-c1cc(C)c2nc(Nc3ccc(OCCCN4CCCC4)cc3)nnc2c1