Reaction Details
TargetProto-oncogene tyrosine-protein kinase Src
LigandBDBM50221565
Substrate/Competitorn/a
Meas. Tech.Luciferase-Based Assay
Temperature298.15±n/a K
IC50 3.2±0.0 nM
Commentsextracted
Citation Gong, XBarrett, KCao, JGritzen, CNoronha, GHood, JDMak, CCMcPherson, APathak, VPRenick, JSoll, RMSplittgerber, UWrasidlo, WZeng, BZhao, NDneprovskaia, E Benzotriazine inhibitors of kinases US Patent US8481536 Publication Date 7/9/2013
 
Proto-oncogene tyrosine-protein kinase Src
Name:Proto-oncogene tyrosine-protein kinase Src
Type:Protein
Mol. Mass.:59838.60
Organism:Homo sapiens (Human)
Description:P12931
Residue:536
BDBM50221565
NameBDBM50221565
Synonyms:4-(7-(2-chloro-5-hydroxyphenyl)-5-methylbenzo[e][1,2,4]triazin-3-ylamino)-N-ethyl-N-(2-(pyrrolidin-1-yl)ethyl)benzenesulfonamide US8481536, 538
TypeSmall organic molecule
Emp. Form.C28H31ClN6O3S
Mol. Mass.567.102
SMILESCCN(CCN1CCCC1)S(=O)(=O)c1ccc(Nc2nnc3cc(cc(C)c3n2)-c2cc(O)ccc2Cl)cc1