Reaction Details
TargetProto-oncogene tyrosine-protein kinase Src
LigandBDBM97956
Substrate/Competitorn/a
Meas. Tech.Luciferase-Based Assay
Temperature298.15±n/a K
IC50 3.4±0.0 nM
Commentsextracted
Citation Gong, XBarrett, KCao, JGritzen, CNoronha, GHood, JDMak, CCMcPherson, APathak, VPRenick, JSoll, RMSplittgerber, UWrasidlo, WZeng, BZhao, NDneprovskaia, E Benzotriazine inhibitors of kinases US Patent US8481536 Publication Date 7/9/2013
 
Proto-oncogene tyrosine-protein kinase Src
Name:Proto-oncogene tyrosine-protein kinase Src
Type:Protein
Mol. Mass.:59838.60
Organism:Homo sapiens (Human)
Description:P12931
Residue:536
BDBM97956
NameBDBM97956
Synonyms:US8481536, 542
TypeSmall organic molecule
Emp. Form.C26H26ClN5OS
Mol. Mass.492.036
SMILESCc1cc(cc2nnc(Nc3cccc(SCCN4CCCC4)c3)nc12)-c1cc(O)ccc1Cl