Reaction Details
TargetProto-oncogene tyrosine-protein kinase Src
LigandBDBM97966
Substrate/Competitorn/a
Meas. Tech.Luciferase-Based Assay
Temperature298.15±n/a K
IC50 1.0±0.0 nM
Commentsextracted
Citation Gong, XBarrett, KCao, JGritzen, CNoronha, GHood, JDMak, CCMcPherson, APathak, VPRenick, JSoll, RMSplittgerber, UWrasidlo, WZeng, BZhao, NDneprovskaia, E Benzotriazine inhibitors of kinases US Patent US8481536 Publication Date 7/9/2013
 
Proto-oncogene tyrosine-protein kinase Src
Name:Proto-oncogene tyrosine-protein kinase Src
Type:Protein
Mol. Mass.:59838.60
Organism:Homo sapiens (Human)
Description:P12931
Residue:536
BDBM97966
NameBDBM97966
Synonyms:US8481536, 555
TypeSmall organic molecule
Emp. Form.C27H27ClFN5O3S
Mol. Mass.556.051
SMILESCc1cc(cc2nnc(Nc3ccc(cc3)S(=O)(=O)CCCN3CCCC3)nc12)-c1c(Cl)ccc(O)c1F