Reaction Details
TargetProto-oncogene tyrosine-protein kinase Src
LigandBDBM97967
Substrate/Competitorn/a
Meas. Tech.Luciferase-Based Assay
Temperature298.15±n/a K
IC50 2.4±0.0 nM
Commentsextracted
Citation Gong, XBarrett, KCao, JGritzen, CNoronha, GHood, JDMak, CCMcPherson, APathak, VPRenick, JSoll, RMSplittgerber, UWrasidlo, WZeng, BZhao, NDneprovskaia, E Benzotriazine inhibitors of kinases US Patent US8481536 Publication Date 7/9/2013
 
Proto-oncogene tyrosine-protein kinase Src
Name:Proto-oncogene tyrosine-protein kinase Src
Type:Protein
Mol. Mass.:59838.60
Organism:Homo sapiens (Human)
Description:P12931
Residue:536
BDBM97967
NameBDBM97967
Synonyms:US8481536, 557
TypeSmall organic molecule
Emp. Form.C25H23Cl2N5O3S
Mol. Mass.544.453
SMILESCc1cc(cc2nnc(Nc3ccc(cc3)S(=O)(=O)C3CCNCC3)nc12)-c1c(Cl)ccc(O)c1Cl