Reaction Details
TargetProto-oncogene tyrosine-protein kinase Src
LigandBDBM97974
Substrate/Competitorn/a
Meas. Tech.Luciferase-Based Assay
Temperature298.15±n/a K
IC50 1.2±0.0 nM
Commentsextracted
Citation Gong, XBarrett, KCao, JGritzen, CNoronha, GHood, JDMak, CCMcPherson, APathak, VPRenick, JSoll, RMSplittgerber, UWrasidlo, WZeng, BZhao, NDneprovskaia, E Benzotriazine inhibitors of kinases US Patent US8481536 Publication Date 7/9/2013
 
Proto-oncogene tyrosine-protein kinase Src
Name:Proto-oncogene tyrosine-protein kinase Src
Type:Protein
Mol. Mass.:59838.60
Organism:Homo sapiens (Human)
Description:P12931
Residue:536
BDBM97974
NameBDBM97974
Synonyms:US8481536, 564
TypeSmall organic molecule
Emp. Form.C27H28ClFN6O3S
Mol. Mass.571.066
SMILESCN(CCN1CCCC1)S(=O)(=O)c1ccc(Nc2nnc3cc(cc(C)c3n2)-c2c(Cl)ccc(O)c2F)cc1