Reaction Details
TargetTyrosine-protein kinase Yes
LigandBDBM97937
Substrate/Competitorn/a
Meas. Tech.Luciferase-Based Assay
Temperature298.15±n/a K
IC50 0.7±0.0 nM
Commentsextracted
Citation Gong, XBarrett, KCao, JGritzen, CNoronha, GHood, JDMak, CCMcPherson, APathak, VPRenick, JSoll, RMSplittgerber, UWrasidlo, WZeng, BZhao, NDneprovskaia, E Benzotriazine inhibitors of kinases US Patent US8481536 Publication Date 7/9/2013
 
Tyrosine-protein kinase Yes
Name:Tyrosine-protein kinase Yes
Type:Protein
Mol. Mass.:60801.54
Organism:Homo sapiens (Human)
Description:P07947
Residue:543
BDBM97937
NameBDBM97937
Synonyms:US8481536, 507 | US8481536, 612
TypeSmall organic molecule
Emp. Form.C26H26ClN5O2
Mol. Mass.475.97
SMILESCc1cc2nc(Nc3ccc(OCCN4CCCC4)cc3)nnc2cc1-c1cc(O)ccc1Cl