Reaction Details
TargetHigh affinity nerve growth factor receptor
LigandBDBM50392791
Substrate/Competitorn/a
Meas. Tech.Amplified Luminescent Proximity Assay
Temperature298.15±n/a K
IC50 3±n/a nM
Commentsextracted
Citation Davies, AIoannidis, SLamb, MSu, MWang, TZhang, H 9-(pyrazol-3-yl)-9H-purine-2-amine and 3-(pyrazol-3-yl) -3H-imidazo[4,5-B] pyridin-5-amine derivatives and their use for the treatment of cancer US Patent US8486966 Publication Date 7/16/2013
 
High affinity nerve growth factor receptor
Name:High affinity nerve growth factor receptor
Type:n/a
Mol. Mass.:87498.18
Organism:Homo sapiens (Human)
Description:P04629
Residue:796
BDBM50392791
NameBDBM50392791
Synonyms:CHEMBL2151321 | US8486966, 1
TypeSmall organic molecule
Emp. Form.C19H20FN7O
Mol. Mass.381.4068
SMILESCC(C)Oc1cc(n[nH]1)-n1cnc2ccc(N[C@@H](C)c3ccc(F)cn3)nc12