Reaction Details
TargetCytochrome P450 11B2, mitochondrial
LigandBDBM280316
Substrate/Competitorn/a
Meas. Tech.Inhibitory Effect on hCYP11B2
pH7.4±n/a
Temperature298.15±n/a K
IC50 0.700±n/a nM
Commentsextracted
Citation Ushirogochi, HSasaki, WOnda, YSakakibara, RAkahoshi, F Disubstituted 1, 2, 4-triazine compound US Patent US10029993 Publication Date 7/24/2018
 
Cytochrome P450 11B2, mitochondrial
Name:Cytochrome P450 11B2, mitochondrial
Type:Protein
Mol. Mass.:57582.15
Organism:Homo sapiens (Human)
Description:P19099
Residue:503
BDBM280316
NameBDBM280316
Synonyms:US10029993, Example 183
TypeSmall organic molecule
Emp. Form.C18H24N4O
Mol. Mass.312.4094
SMILESCc1ccccc1-c1cnnc(n1)N1CCC(CCCO)CC1