Reaction Details
TargetKappa-type opioid receptor
LigandBDBM98546
Substrate/Competitorn/a
Meas. Tech.Competitive Inhibition Assay
Ki 55±23 nM
Citation Beguin, CPotuzak, JSMunro, TADuncan, KKCarlezon, WACohen, BMLiu-Chen, L Salvinorin derivatives and uses thereof US Patent US8492564 Publication Date 7/23/2013
 
Kappa-type opioid receptor
Name:Kappa-type opioid receptor
Type:G Protein-Coupled Receptor (GPCR)
Mol. Mass.:42648.76
Organism:Homo sapiens (Human)
Description:P41145
Residue:380
BDBM98546
NameBDBM98546
Synonyms:US8492564, 7
TypeSmall orgnaic molecule
Emp. Form.C20H26O9
Mol. Mass.410.415
SMILESCOC(=O)[C@@H]1C[C@H](OC(C)=O)C(=O)[C@H]2[C@@]1(C)CCC1C(=O)O[C@@H](C[C@]21C)C(O)=O