Reaction Details
TargetSerine protease 1
LigandBDBM50110015
Substrate/Competitorn/a
Meas. Tech.Enzyme Assay
Temperature297.15±0 K
Ki 150±0.0 nM
Citation Stuerzebecher, JSteinmetzer, TSchweinitz, A Urokinase inhibitors, production and use thereof US Patent US8476306 Publication Date 7/2/2013
 
Serine protease 1
Name:Serine protease 1
Type:Protein
Mol. Mass.:25951.67
Organism:Rattus norvegicus
Description:P00762
Residue:246
BDBM50110015
NameBDBM50110015
Synonyms:CHEMBL158936 N-[(4-Carbamimidoyl-benzylcarbamoyl)-methyl]-3-hydroxy-2-phenylmethanesulfonylamino-propionamide US8476306, 6.2
TypeSmall organic molecule
Emp. Form.C20H25N5O5S
Mol. Mass.447.508
SMILESNC(=N)c1ccc(CNC(=O)CNC(=O)[C@@H](CO)NS(=O)(=O)Cc2ccccc2)cc1