Reaction Details
TargetSerine protease 1
LigandBDBM98585
Substrate/Competitorn/a
Meas. Tech.Enzyme Assay
Temperature297.15±0 K
Ki 340±0.0 nM
Citation Stuerzebecher, JSteinmetzer, TSchweinitz, A Urokinase inhibitors, production and use thereof US Patent US8476306 Publication Date 7/2/2013
 
Serine protease 1
Name:Serine protease 1
Type:Protein
Mol. Mass.:25951.67
Organism:Rattus norvegicus
Description:P00762
Residue:246
BDBM98585
NameBDBM98585
Synonyms:(2R)-N-[(1S)-2-[(4-carbamimidoylphenyl)methylamino]-1-methyl-2-oxo-ethyl]-2-[(4-cyanophenyl)methylsulfonylamino]-3-hydroxy-propanamide | US8476306, 6.10
TypeSmall organic molecule
Emp. Form.C22H26N6O5S
Mol. Mass.486.544
SMILESC[C@H](NC(=O)[C@@H](CO)NS(=O)(=O)Cc1ccc(cc1)C#N)C(=O)NCc1ccc(cc1)C(N)=N