Reaction Details
TargetSerine protease 1
LigandBDBM98600
Substrate/Competitorn/a
Meas. Tech.Enzyme Assay
Temperature297.15±0 K
Ki 7±0.0 nM
Citation Stuerzebecher, JSteinmetzer, TSchweinitz, A Urokinase inhibitors, production and use thereof US Patent US8476306 Publication Date 7/2/2013
 
Serine protease 1
Name:Serine protease 1
Type:Protein
Mol. Mass.:25951.67
Organism:Rattus norvegicus
Description:P00762
Residue:246
BDBM98600
NameBDBM98600
Synonyms:(2S)-2-[[(2R)-2-(benzylsulfonylamino)-3-hydroxy-propanoyl]amino]-N-[(4-carbamimidoylphenyl)methyl]-5-guanidino-pentanamide | US8476306, 8.2
TypeSmall organic molecule
Emp. Form.C24H34N8O5S
Mol. Mass.546.642
SMILES[#7]\[#6](-[#7])=[#7]/[#6]-[#6]-[#6]-[#6@H](-[#7]-[#6](=O)-[#6@@H](-[#6]-[#8])-[#7]S(=O)(=O)[#6]-c1ccccc1)-[#6](=O)-[#7]-[#6]-c1ccc(cc1)-[#6](-[#7])=[#7]