Reaction Details
TargetProtein kinase C alpha type
LigandBDBM98662
Substrate/Competitorn/a
Meas. Tech.Binding Assay
IC50 3.8±0.0 nM
Citation Wender, PA Bryostatin analogues, synthetic methods and uses US Patent US8497385 Publication Date 7/30/2013
 
Protein kinase C alpha type
Name:Protein kinase C alpha type
Type:Protein
Mol. Mass.:76797.67
Organism:Rattus norvegicus (Rat)
Description:P05696
Residue:672
BDBM98662
NameBDBM98662
Synonyms:US8497385, 19B.2
TypeSmall organic molecule
Emp. Form.C48H74O15
Mol. Mass.891.0922
SMILESCCCCCCCC(=O)O[C@H]1\C(C[C@H]2C[C@H](CO)OC(=O)C[C@H](O)CCO[C@@H](C[C@@H]3CCO[C@@H](O3)\C=C\C(C)(C)[C@]1(O)O2)c1ccc(CCCOCCOCC)cc1)=C\C(=O)OC