Reaction Details
TargetProtein kinase C alpha type
LigandBDBM98664
Substrate/Competitorn/a
Meas. Tech.Binding Assay
IC50 30±0.0 nM
Citation Wender, PA Bryostatin analogues, synthetic methods and uses US Patent US8497385 Publication Date 7/30/2013
 
Protein kinase C alpha type
Name:Protein kinase C alpha type
Type:Protein
Mol. Mass.:76797.67
Organism:Rattus norvegicus (Rat)
Description:P05696
Residue:672
BDBM98664
NameBDBM98664
Synonyms:US8497385, 19B.4
TypeSmall organic molecule
Emp. Form.C55H86O13
Mol. Mass.955.2635
SMILESCCCCCCCCCCCC\C=C\c1ccc(cc1)[C@@H]1C[C@@H]2CCO[C@@H](O2)\C=C\C(C)(C)[C@]2(O)O[C@@H](C\C(=C/C(=O)OC)[C@@H]2OC(=O)CCCCCCC)C[C@H](CO)OC(=O)C[C@H](O)CCO1