Reaction Details
TargetGag-Pol polyprotein
LigandBDBM98667
Substrate/Competitorn/a
Meas. Tech.Inhibition Assay
IC50 1.0e+3±n/a nM
Citation Thuring, JWBonfanti, JFortin, JM Macrocyclic integrase inhibitors US Patent US8497270 Publication Date 7/30/2013
 
Gag-Pol polyprotein
Name:Gag-Pol polyprotein
Type:Protein
Mol. Mass.:163312.58
Organism:Human immunodeficiency virus type 1 (HIV-1)
Description:P03367
Residue:1447
BDBM98667
NameBDBM98667
Synonyms:US8497270, 28
TypeSmall organic molecule
Emp. Form.C5H12ClNO2S
Mol. Mass.185.672
SMILESCNS(=O)(=O)CCCCCl