Reaction Details
TargetGag-Pol polyprotein
LigandBDBM98670
Substrate/Competitorn/a
Meas. Tech.Inhibition Assay
IC50 1.2e+3±n/a nM
Citation Thuring, JWBonfanti, JFortin, JM Macrocyclic integrase inhibitors US Patent US8497270 Publication Date 7/30/2013
 
Gag-Pol polyprotein
Name:Gag-Pol polyprotein
Type:Protein
Mol. Mass.:163312.58
Organism:Human immunodeficiency virus type 1 (HIV-1)
Description:P03367
Residue:1447
BDBM98670
NameBDBM98670
Synonyms:US8497270, 31
TypeSmall organic molecule
Emp. Form.C10H22N2O4S
Mol. Mass.266.358
SMILESCNS(=O)(=O)CCCCNC(=O)OC(C)(C)C