Reaction Details
TargetAdenosine receptor A3
LigandBDBM99193
Substrate/Competitorn/a
Meas. Tech.Binding Assay
Ki 820±0.0 nM
Citation Jagtap, P Adenosine compounds and their use thereof US Patent US8501708 Publication Date 8/6/2013
 
Adenosine receptor A3
Name:Adenosine receptor A3
Type:Protein
Mol. Mass.:36319.35
Organism:Oryctolagus cuniculus (rabbit)
Description:O02667
Residue:319
BDBM99193
NameBDBM99193
Synonyms:US8501708, 13
TypeSmall organic molecule
Emp. Form.C23H29N5O5
Mol. Mass.455.5069
SMILESCc1ccc(CO[C@H]2CCCC2Nc2ncnc3n(cnc23)C2O[C@H](CO)[C@@H](O)[C@H]2O)cc1