Reaction Details
TargetAdenosine receptor A3
LigandBDBM99199
Substrate/Competitorn/a
Meas. Tech.Binding Assay
Ki 1630±0.0 nM
Citation Jagtap, P Adenosine compounds and their use thereof US Patent US8501708 Publication Date 8/6/2013
 
Adenosine receptor A3
Name:Adenosine receptor A3
Type:Protein
Mol. Mass.:36319.35
Organism:Oryctolagus cuniculus (rabbit)
Description:O02667
Residue:319
BDBM99199
NameBDBM99199
Synonyms:US8501708, 19
TypeSmall organic molecule
Emp. Form.C22H26FN5O5
Mol. Mass.459.4707
SMILESOC[C@H]1OC([C@H](O)[C@@H]1O)n1cnc2c(NC3CCC[C@@H]3OCc3ccc(F)cc3)ncnc12