Reaction Details
TargetAdenosine receptor A3
LigandBDBM99203
Substrate/Competitorn/a
Meas. Tech.Binding Assay
Ki 2300±0.0 nM
Citation Jagtap, P Adenosine compounds and their use thereof US Patent US8501708 Publication Date 8/6/2013
 
Adenosine receptor A3
Name:Adenosine receptor A3
Type:Protein
Mol. Mass.:36319.35
Organism:Oryctolagus cuniculus (rabbit)
Description:O02667
Residue:319
BDBM99203
NameBDBM99203
Synonyms:US8501708, 23
TypeSmall organic molecule
Emp. Form.C23H28ClN5O5
Mol. Mass.489.952
SMILESCc1cccc(CO[C@H]2CCCC2Nc2nc(Cl)nc3n(cnc23)C2O[C@H](CO)[C@@H](O)[C@H]2O)c1