Reaction Details
TargetAdenosine receptor A3
LigandBDBM99209
Substrate/Competitorn/a
Meas. Tech.Binding Assay
Ki 551±0.0 nM
Citation Jagtap, P Adenosine compounds and their use thereof US Patent US8501708 Publication Date 8/6/2013
 
Adenosine receptor A3
Name:Adenosine receptor A3
Type:Protein
Mol. Mass.:36319.35
Organism:Oryctolagus cuniculus (rabbit)
Description:O02667
Residue:319
BDBM99209
NameBDBM99209
Synonyms:US8501708, 33
TypeSmall organic molecule
Emp. Form.C23H29N5O6
Mol. Mass.471.5063
SMILESCOc1cccc(CO[C@@H]2CCCC2Nc2ncnc3n(cnc23)[C@@H]2O[C@H](CO)[C@@H](O)[C@H]2O)c1