Reaction Details
TargetReverse transcriptase protein
LigandBDBM99895
Substrate/Competitorn/a
Meas. Tech.Enzyme Inhibition Assay
IC50 1.128e+4±n/a nM
Citation Bode, MLRousseau, ALGravestock, DMoleele, SSVan Der Westhuyzen, CW Imidazopyridines and imidazopyrimidines as HIV-1 reverse transcriptase inhibitors US Patent US8501767 Publication Date 8/6/2013
 
Reverse transcriptase protein
Name:Reverse transcriptase protein
Synonyms:n/a
Type:Protein
Mol. Mass.:30157.99
Organism:Human immunodeficiency virus 1
Description:Q9WJP9
Residue:259
BDBM99895
NameBDBM99895
Synonyms:US8501767, 81
TypeSmall organic molecule
Emp. Form.C19H19ClFN3
Mol. Mass.343.826
SMILESFc1ccc2nc(c(NC3CCCCC3)n2c1)-c1ccccc1Cl