Reaction Details
TargetGag-Pol polyprotein
LigandBDBM99898
Substrate/Competitorn/a
Meas. Tech.Enzyme Inhibition Assay
Ki 0.16±0.04 nM
Citation Ghosh, AK HIV protease inhibitors and methods for using US Patent US8501961 Publication Date 8/6/2013
 
Gag-Pol polyprotein
Name:Gag-Pol polyprotein
Type:Protein
Mol. Mass.:162047.84
Organism:Human immunodeficiency virus type 1 group M subtype B (isolate ARV2/SF2) (HIV-1)
Description:P03369
Residue:1437
BDBM99898
NameBDBM99898
Synonyms:US8501961, 3b
TypeSmall organic molecule
Emp. Form.C27H38N2O8S
Mol. Mass.550.664
SMILESCOc1ccc(cc1)S(=O)(=O)N(CC(C)C)C[C@@H](O)[C@H](Cc1ccccc1)NC(=O)O[C@H]1CCOCOC1