Reaction Details
Target5-hydroxytryptamine receptor 3A
LigandBDBM50334447
Substrate/Competitorn/a
Meas. Tech.Radioligand Binding Assay
pH7.5±0
Ki 2±0.0 nM
Citation Manning, DDCioffi, CL 5-HT3 receptor modulators, methods of making, and use thereof US Patent US8501729 Publication Date 8/6/2013
 
5-hydroxytryptamine receptor 3A
Name:5-hydroxytryptamine receptor 3A
Type:Protein
Mol. Mass.:55283.27
Organism:Homo sapiens (Human)
Description:P46098
Residue:478
BDBM50334447
NameBDBM50334447
Synonyms:(S)-2-isopropyl-7-(quinuclidin-3-yl)-7,8-dihydropyrazolo[3,4,5-de]isoquinolin-6(2H)-one US8501729, 7
TypeSmall organic molecule
Emp. Form.C19H24N4O
Mol. Mass.324.4201
SMILESCC(C)n1[nH]c2cn([C@@H]3CN4CCC3CC4)c(=O)c3cccc1c23