Reaction Details
Target5-hydroxytryptamine receptor 3A
LigandBDBM99926
Substrate/Competitorn/a
Meas. Tech.Radioligand Binding Assay
pH7.5±0
Ki 1±0.0 nM
Citation Manning, DDCioffi, CL 5-HT3 receptor modulators, methods of making, and use thereof US Patent US8501729 Publication Date 8/6/2013
 
5-hydroxytryptamine receptor 3A
Name:5-hydroxytryptamine receptor 3A
Type:Protein
Mol. Mass.:55283.27
Organism:Homo sapiens (Human)
Description:P46098
Residue:478
BDBM99926
NameBDBM99926
Synonyms:US8501729, 21
TypeSmall organic molecule
Emp. Form.C16H17BrN4O
Mol. Mass.361.236
SMILESBrc1cc2[nH][nH]c3cn([C@H]4CN5CCC4CC5)c(=O)c(c1)c23