Reaction Details
Target5-hydroxytryptamine receptor 3A
LigandBDBM99935
Substrate/Competitorn/a
Meas. Tech.Radioligand Binding Assay
pH7.5±0
Ki 1±0.0 nM
Citation Manning, DDCioffi, CL 5-HT3 receptor modulators, methods of making, and use thereof US Patent US8501729 Publication Date 8/6/2013
 
5-hydroxytryptamine receptor 3A
Name:5-hydroxytryptamine receptor 3A
Type:Protein
Mol. Mass.:55283.27
Organism:Homo sapiens (Human)
Description:P46098
Residue:478
BDBM99935
NameBDBM99935
Synonyms:US8501729, 31
TypeSmall organic molecule
Emp. Form.C19H23N3O
Mol. Mass.309.4054
SMILESCn1cc2CCN([C@@H]3CN4CCC3CC4)C(=O)c3cccc1c23