Reaction Details
TargetKallikrein-7
LigandBDBM90096
Substrate/Competitorn/a
EC50 6859±n/a nM
Citation PubChem, PC Fluorescence Intensity-based biochemical primary high throughput dose response assay to identify activators of kallikrein-7 (K7) zymogen PubChem Bioassay(2013)[AID]
 
Kallikrein-7
Name:Kallikrein-7
Type:PROTEIN
Mol. Mass.:27535.05
Organism:Homo sapiens (Human)
Description:ChEMBL_1469257
Residue:253
BDBM90096
NameBDBM90096
Synonyms:MLS000578964 butyl 3-(3-methylphenoxy)-4-oxo-4H-chromen-7-yl carbonate butyl [3-(3-methylphenoxy)-4-oxochromen-7-yl] carbonate carbonic acid butyl [4-keto-3-(3-methylphenoxy)chromen-7-yl] ester | cid_1638351
TypeSmall organic molecule
Emp. Form.C21H20O6
Mol. Mass.368.3799
SMILESCCCCOC(=O)Oc1ccc2c(c1)occ(Oc1cccc(C)c1)c2=O