Reaction Details
TargetKallikrein-7
LigandBDBM100058
Substrate/Competitorn/a
EC50>7723±n/a nM
Citation PubChem, PC Fluorescence Intensity-based biochemical primary high throughput dose response assay to identify activators of kallikrein-7 (K7) zymogen PubChem Bioassay(2013)[AID]
 
Kallikrein-7
Name:Kallikrein-7
Type:PROTEIN
Mol. Mass.:27535.05
Organism:Homo sapiens (Human)
Description:ChEMBL_1469257
Residue:253
BDBM100058
NameBDBM100058
Synonyms:MLS000718244 N-cyclopentyl-2-(4-fluorophenyl)imidazo[1,2-a]pyrazin-3-amine cid_4114964 | cyclopentyl-[2-(4-fluorophenyl)imidazo[1,2-a]pyrazin-3-yl]amine
TypeSmall organic molecule
Emp. Form.C17H17FN4
Mol. Mass.296.3421
SMILESFc1ccc(cc1)-c1nc2cnccn2c1NC1CCCC1