Reaction Details
TargetKallikrein-7
LigandBDBM100087
Substrate/Competitorn/a
EC50 8200±n/a nM
Citation PubChem, PC Fluorescence Intensity-based biochemical primary high throughput dose response assay to identify activators of kallikrein-7 (K7) zymogen PubChem Bioassay(2013)[AID]
 
Kallikrein-7
Name:Kallikrein-7
Type:PROTEIN
Mol. Mass.:27535.05
Organism:Homo sapiens (Human)
Description:ChEMBL_1469257
Residue:253
BDBM100087
NameBDBM100087
Synonyms:(4S)-6-amino-5-cyano-2-(2-keto-2-methoxy-ethyl)-4-(2-nitrophenyl)-4H-pyran-3-carboxylic acid methyl ester (S)-6-Amino-5-cyano-2-methoxycarbonylmethyl-4-(2-nitro-phenyl)-4H-pyran-3-carboxylic acid methyl ester SMR000420118 methyl (4S)-6-amino-5-cyano-2-(2-methoxy-2-oxoethyl)-4-(2-nitrophenyl)-4H-pyran-3-carboxylate | methyl (4S)-6-azanyl-5-cyano-2-(2-methoxy-2-oxidanylidene-ethyl)-4-(2-nitrophenyl)-4H-pyran-3-carboxylate
TypeSmall organic molecule
Emp. Form.C17H15N3O7
Mol. Mass.373.3169
SMILESCOC(=O)CC1=C(C([C-](C#N)C(=[NH2+])O1)c1ccccc1[N+]([O-])=O)C(=O)OC