Reaction Details
TargetKallikrein-7
LigandBDBM100100
Substrate/Competitorn/a
EC50 3774±n/a nM
Citation PubChem, PC Fluorescence Intensity-based biochemical primary high throughput dose response assay to identify activators of kallikrein-7 (K7) zymogen PubChem Bioassay(2013)[AID]
 
Kallikrein-7
Name:Kallikrein-7
Type:PROTEIN
Mol. Mass.:27535.05
Organism:Homo sapiens (Human)
Description:ChEMBL_1469257
Residue:253
BDBM100100
NameBDBM100100
Synonyms:3-Methyl-1-methylamino-benzo[4,5]imidazo[1,2-a]pyridine-4-carbonitrile 3-methyl-1-(methylamino)pyrido[1,2-a]benzimidazole-4-carbonitrile SMR000514701 | cid_767452
TypeSmall organic molecule
Emp. Form.C14H12N4
Mol. Mass.236.2719
SMILESCNc1cc(C)c(C#N)c2nc3ccccc3n12