Reaction Details
TargetKallikrein-7
LigandBDBM52033
Substrate/Competitorn/a
EC50 48955±n/a nM
Citation PubChem, PC Fluorescence Intensity-based biochemical primary high throughput dose response assay to identify activators of kallikrein-7 (K7) zymogen PubChem Bioassay(2013)[AID]
 
Kallikrein-7
Name:Kallikrein-7
Type:PROTEIN
Mol. Mass.:27535.05
Organism:Homo sapiens (Human)
Description:ChEMBL_1469257
Residue:253
BDBM52033
NameBDBM52033
Synonyms:(2S)-2-[[1-oxo-2-[(4,8,8-trimethyl-2-oxo-9,10-dihydropyrano[2,3-h][1]benzopyran-5-yl)oxy]ethyl]amino]-3-phenylpropanoic acid (2S)-3-phenyl-2-[2-[(4,8,8-trimethyl-2-oxidanylidene-9,10-dihydropyrano[2,3-h]chromen-5-yl)oxy]ethanoylamino]propanoic acid MLS001140249 cid_16406199
TypeSmall organic molecule
Emp. Form.C26H27NO7
Mol. Mass.465.4951
SMILESCc1cc(=O)oc2c3CCC(C)(C)Oc3cc(OCC(=O)N[C@@H](Cc3ccccc3)C(O)=O)c12