Reaction Details
TargetKallikrein-7
LigandBDBM100163
Substrate/Competitorn/a
EC50 4100±n/a nM
Citation PubChem, PC Fluorescence Intensity-based biochemical primary high throughput dose response assay to identify activators of kallikrein-7 (K7) zymogen PubChem Bioassay(2013)[AID]
 
Kallikrein-7
Name:Kallikrein-7
Type:PROTEIN
Mol. Mass.:27535.05
Organism:Homo sapiens (Human)
Description:ChEMBL_1469257
Residue:253
BDBM100163
NameBDBM100163
Synonyms:2-[4-amino-5-(4-methoxyphenyl)-3-methylpyrazolo[3,4-d]pyrimidin-6-yl]sulfanyl-N-(2-ethylphenyl)acetamide 2-[[4-amino-5-(4-methoxyphenyl)-3-methyl-6-pyrazolo[3,4-d]pyrimidinyl]thio]-N-(2-ethylphenyl)acetamide MLS002589313 SMR000033123 | cid_3238110
TypeSmall organic molecule
Emp. Form.C23H24N6O2S
Mol. Mass.448.541
SMILESCCc1ccccc1NC(=O)CSc1nc2nnc(C)c2c(N)n1-c1ccc(OC)cc1