Reaction Details
TargetCOUP transcription factor 2
LigandBDBM42411
Substrate/Competitorn/a
IC50 3519±n/a nM
Citation PubChem, PC Luminescence-based cell-based high throughput dose response assay to identify inhibitors of COUP-TFII (NR2F2) PubChem Bioassay(2013)[AID]
 
COUP transcription factor 2
Name:COUP transcription factor 2
Type:Enzyme Catalytic Domain
Mol. Mass.:45583.83
Organism:Homo sapiens (Human)
Description:gi_14149746
Residue:414
BDBM42411
NameBDBM42411
Synonyms:(4-hexyl-1,2,3,5,6,7-hexahydrodicyclopenta[1,2-c:1',2'-g]pyridin-8-ylidene)amine;hydrobromide MLS000080127 cid_6603435
TypeSmall organic molecule
Emp. Form.C17H26N2
Mol. Mass.258.4017
SMILESCCCCCCn1c2CCCc2c(=N)c2CCCc12