Reaction Details
TargetCOUP transcription factor 2
LigandBDBM37434
Substrate/Competitorn/a
IC50 567.98±n/a nM
Citation PubChem, PC Luminescence-based cell-based high throughput dose response assay to identify inhibitors of COUP-TFII (NR2F2) PubChem Bioassay(2013)[AID]
 
COUP transcription factor 2
Name:COUP transcription factor 2
Type:Enzyme Catalytic Domain
Mol. Mass.:45583.83
Organism:Homo sapiens (Human)
Description:gi_14149746
Residue:414
BDBM37434
NameBDBM37434
Synonyms:2-[(1-bicyclo[2.2.1]hept-2-yl-1H-tetrazol-5-yl)thio]-N-4-quinolinylacetamide 2-[[1-(2-norbornyl)tetrazol-5-yl]thio]-N-(4-quinolyl)acetamide 2-[[1-(3-bicyclo[2.2.1]heptanyl)-5-tetrazolyl]thio]-N-(4-quinolinyl)acetamide SMR000079553 | cid_2967368
TypeSmall organic molecule
Emp. Form.C19H20N6OS
Mol. Mass.380.467
SMILES[H]C12CCC([H])(C1)C(C2)n1nnnc1SCC(=O)Nc1ccnc2ccccc12