Reaction Details
TargetCOUP transcription factor 2
LigandBDBM97164
Substrate/Competitorn/a
IC50 2048±n/a nM
Citation PubChem, PC Luminescence-based cell-based high throughput dose response assay to identify inhibitors of COUP-TFII (NR2F2) PubChem Bioassay(2013)[AID]
 
COUP transcription factor 2
Name:COUP transcription factor 2
Type:Enzyme Catalytic Domain
Mol. Mass.:45583.83
Organism:Homo sapiens (Human)
Description:gi_14149746
Residue:414
BDBM97164
NameBDBM97164
Synonyms:MLS002159131 N-[(3,4-dimethoxyphenyl)methyl]-N-methyl-4-(4-methylpiperazin-1-yl)sulfonyl-2-nitroaniline SMR001241592 methyl-[4-(4-methylpiperazino)sulfonyl-2-nitro-phenyl]-veratryl-amine
TypeSmall organic molecule
Emp. Form.C21H28N4O6S
Mol. Mass.464.535
SMILESCOc1ccc(CN(C)c2ccc(cc2[N+]([O-])=O)S(=O)(=O)N2CCN(C)CC2)cc1OC