Reaction Details
TargetCOUP transcription factor 2
LigandBDBM89484
Substrate/Competitorn/a
IC50>12.98±n/a nM
Citation PubChem, PC Luminescence-based cell-based high throughput dose response assay to identify inhibitors of COUP-TFII (NR2F2) PubChem Bioassay(2013)[AID]
 
COUP transcription factor 2
Name:COUP transcription factor 2
Type:Enzyme Catalytic Domain
Mol. Mass.:45583.83
Organism:Homo sapiens (Human)
Description:gi_14149746
Residue:414
BDBM89484
NameBDBM89484
Synonyms:MLS002702998 SMR001566807 | cid_5351598
TypeSmall organic molecule
Emp. Form.C49H85NO14
Mol. Mass.912.1975
SMILES[H][C@@]12CC(C)(C)O[C@@]1(O)C[C@]1([H])O[C@]3(CCC[C@H](C[C@H](O)CC)O3)C[C@]([H])(OC(=O)\C=C\[C@@](C)(O)[C@@H](O)[C@H](C)[C@@H](O)[C@H](OC3CCC(C(C)O3)N(C)C)[C@@H](O)[C@](C)(O)CCCCC\C=C/2)[C@@H]1C