Reaction Details
TargetPro-glucagon
LigandBDBM100798
Substrate/Competitorn/a
Meas. Tech.Glucagon SPA Assay
pH7.4±0
Ki 91.9±0.0 nM
Citation Aspnes, GEDidiuk, MTFilipski, KJGuzman-Perez, ALee, ECPfefferkorn, JAStevens, BDTu, MM Glucagon receptor modulators US Patent US8507533 Publication Date 8/13/2013
 
Pro-glucagon
Name:Pro-glucagon
Type:Enzyme
Mol. Mass.:20907.95
Organism:Homo sapiens (Human)
Description:P01275
Residue:180
BDBM100798
NameBDBM100798
Synonyms:US8507533, 106
TypeSmall organic molecule
Emp. Form.C24H24F3N5O3
Mol. Mass.487.4743
SMILESOC(=O)CCNC(=O)c1ccc(cc1)C(Nc1ccc(nc1)-n1cc(cn1)C(F)(F)F)C1CCC1