Reaction Details
TargetPro-glucagon
LigandBDBM100801
Substrate/Competitorn/a
Meas. Tech.Glucagon SPA Assay
pH7.4±0
Ki 57.2±0.0 nM
Citation Aspnes, GEDidiuk, MTFilipski, KJGuzman-Perez, ALee, ECPfefferkorn, JAStevens, BDTu, MM Glucagon receptor modulators US Patent US8507533 Publication Date 8/13/2013
 
Pro-glucagon
Name:Pro-glucagon
Type:Enzyme
Mol. Mass.:20907.95
Organism:Homo sapiens (Human)
Description:P01275
Residue:180
BDBM100801
NameBDBM100801
Synonyms:US8507533, 109 | US8507533, 322
TypeSmall organic molecule
Emp. Form.C23H23F4N5O3
Mol. Mass.493.454
SMILESCCCC(Nc1ccc(nc1)-n1cc(cn1)C(F)(F)F)c1ccc(cc1F)C(=O)NCCC(O)=O