Reaction Details
TargetPro-glucagon
LigandBDBM100827
Substrate/Competitorn/a
Meas. Tech.Glucagon SPA Assay
pH7.4±0
Ki 5.75±0.0 nM
Citation Aspnes, GEDidiuk, MTFilipski, KJGuzman-Perez, ALee, ECPfefferkorn, JAStevens, BDTu, MM Glucagon receptor modulators US Patent US8507533 Publication Date 8/13/2013
 
Pro-glucagon
Name:Pro-glucagon
Type:Enzyme
Mol. Mass.:20907.95
Organism:Homo sapiens (Human)
Description:P01275
Residue:180
BDBM100827
NameBDBM100827
Synonyms:US8507533, 138 US8507533, 374
TypeSmall organic molecule
Emp. Form.C27H28F3N3O4
Mol. Mass.515.5241
SMILESCc1cc(OC(C2CCC2)c2ccc(cc2)C(=O)NCCC(O)=O)cc(C)c1-n1cc(cn1)C(F)(F)F