Reaction Details
TargetPro-glucagon
LigandBDBM100823
Substrate/Competitorn/a
Meas. Tech.Glucagon SPA Assay
pH7.4±0
Ki 93.2±0.0 nM
Citation Aspnes, GEDidiuk, MTFilipski, KJGuzman-Perez, ALee, ECPfefferkorn, JAStevens, BDTu, MM Glucagon receptor modulators US Patent US8507533 Publication Date 8/13/2013
 
Pro-glucagon
Name:Pro-glucagon
Type:Enzyme
Mol. Mass.:20907.95
Organism:Homo sapiens (Human)
Description:P01275
Residue:180
BDBM100823
NameBDBM100823
Synonyms:US8507533, 130 | US8507533, 369
TypeSmall organic molecule
Emp. Form.C25H28ClN3O4
Mol. Mass.469.961
SMILESCCCC(Oc1cc(C)c(c(C)c1)-n1cc(Cl)cn1)c1ccc(cc1)C(=O)NCCC(O)=O