Reaction Details
TargetPro-glucagon
LigandBDBM100861
Substrate/Competitorn/a
Meas. Tech.Glucagon SPA Assay
pH7.4±0
Ki 42.2±0.0 nM
Citation Aspnes, GEDidiuk, MTFilipski, KJGuzman-Perez, ALee, ECPfefferkorn, JAStevens, BDTu, MM Glucagon receptor modulators US Patent US8507533 Publication Date 8/13/2013
 
Pro-glucagon
Name:Pro-glucagon
Type:Enzyme
Mol. Mass.:20907.95
Organism:Homo sapiens (Human)
Description:P01275
Residue:180
BDBM100861
NameBDBM100861
Synonyms:US8507533, 188
TypeSmall organic molecule
Emp. Form.C26H28F3N5O3
Mol. Mass.515.5274
SMILESCC1(C)CC(C1)C(Nc1ccc(nc1)-n1cnc(c1)C(F)(F)F)c1ccc(cc1)C(=O)NCCC(O)=O