Reaction Details
TargetPro-glucagon
LigandBDBM100860
Substrate/Competitorn/a
Meas. Tech.Glucagon SPA Assay
pH7.4±0
Ki 109±0.0 nM
Citation Aspnes, GEDidiuk, MTFilipski, KJGuzman-Perez, ALee, ECPfefferkorn, JAStevens, BDTu, MM Glucagon receptor modulators US Patent US8507533 Publication Date 8/13/2013
 
Pro-glucagon
Name:Pro-glucagon
Type:Enzyme
Mol. Mass.:20907.95
Organism:Homo sapiens (Human)
Description:P01275
Residue:180
BDBM100860
NameBDBM100860
Synonyms:US8507533, 187 US8507533, 450
TypeSmall organic molecule
Emp. Form.C29H31N3O4
Mol. Mass.485.5741
SMILESCCCC(Oc1cc(C)c(c(C)c1)-n1cc2ccccc2n1)c1ccc(cc1)C(=O)NCCC(O)=O