Reaction Details
TargetPro-glucagon
LigandBDBM2241
Substrate/Competitorn/a
Meas. Tech.Glucagon SPA Assay
Ki 30.2±n/a nM
Citation Aspnes, GEDidiuk, MTFilipski, KJGuzman-Perez, ALee, ECPfefferkorn, JAStevens, BDTu, MM Glucagon receptor modulators US Patent US8507533 Publication Date 8/13/2013
 
Pro-glucagon
Name:Pro-glucagon
Type:Enzyme
Mol. Mass.:20907.95
Organism:Homo sapiens (Human)
Description:P01275
Residue:180
BDBM2241
NameBDBM2241
Synonyms:US8507533, 136
Typen/a
Emp. Form.C26H33N5O3
Mol. Mass.463.5719
SMILESCCC[C@@H](Nc1ccc(nc1)-n1cc(cn1)C(C)(C)C)c1ccc(cc1)C(=O)NCCC(O)=O